{"text_format":"1","workbook":"xlsx","n_sheets":2,"sheets":["Base Dati","Config"],"not_rendered":{"charts":0,"images":1,"macros":1,"external_links":0,"defined_names":2,"comments":0,"pivot_tables":0},"unopened":[],"bounds":{"document_bytes":16777216,"sheet_cells":100000,"rows_first":2000,"rows_last":500,"rows_between":2000,"halvings":0,"cell_chars":16384,"cell_head_chars":4096},"cells_cut":0,"cells_raw":0,"read":"whole","date_system":"1900"}

{"sheet":"Base Dati","index":0,"n_rows":30,"n_cols":9,"rows_kept":30,"cut":false,"hidden":false,"merged":[]}
["NOME","SIGLA","NUMERO","Dati1","Dati2","Dati3","Dati4","Dati5","Dati6"]
["PEPPE",{"$f":"IF(A2<>\"\",VLOOKUP($A2,Config!A:B,2,0),\"\")","v":"PEP"}]
[null,{"$f":"IF(A3<>\"\",VLOOKUP($A3,Config!A:B,2,0),\"\")","v":""}]
[null,{"$f":"IF(A4<>\"\",VLOOKUP($A4,Config!A:B,2,0),\"\")","v":""}]
[null,{"$f":"IF(A5<>\"\",VLOOKUP($A5,Config!A:B,2,0),\"\")","v":""}]
[null,{"$f":"IF(A6<>\"\",VLOOKUP($A6,Config!A:B,2,0),\"\")","v":""}]
[null,{"$f":"IF(A7<>\"\",VLOOKUP($A7,Config!A:B,2,0),\"\")","v":""}]
[null,{"$f":"IF(A8<>\"\",VLOOKUP($A8,Config!A:B,2,0),\"\")","v":""}]
[null,{"$f":"IF(A9<>\"\",VLOOKUP($A9,Config!A:B,2,0),\"\")","v":""}]
[null,{"$f":"IF(A10<>\"\",VLOOKUP($A10,Config!A:B,2,0),\"\")","v":""}]
[null,{"$f":"IF(A11<>\"\",VLOOKUP($A11,Config!A:B,2,0),\"\")","v":""}]
[null,{"$f":"IF(A12<>\"\",VLOOKUP($A12,Config!A:B,2,0),\"\")","v":""}]
[null,{"$f":"IF(A13<>\"\",VLOOKUP($A13,Config!A:B,2,0),\"\")","v":""}]
[null,{"$f":"IF(A14<>\"\",VLOOKUP($A14,Config!A:B,2,0),\"\")","v":""}]
["PEPPE",{"$f":"IF(A15<>\"\",VLOOKUP($A15,Config!A:B,2,0),\"\")","v":"PEP"}]
[null,{"$f":"IF(A16<>\"\",VLOOKUP($A16,Config!A:B,2,0),\"\")","v":""}]
[null,{"$f":"IF(A17<>\"\",VLOOKUP($A17,Config!A:B,2,0),\"\")","v":""}]
[null,{"$f":"IF(A18<>\"\",VLOOKUP($A18,Config!A:B,2,0),\"\")","v":""}]
[null,{"$f":"IF(A19<>\"\",VLOOKUP($A19,Config!A:B,2,0),\"\")","v":""}]
[null,{"$f":"IF(A20<>\"\",VLOOKUP($A20,Config!A:B,2,0),\"\")","v":""}]
[]
["PEPPE",{"$f":"IF(A22<>\"\",VLOOKUP($A22,Config!A:B,2,0),\"\")","v":"PEP"}]
[null,{"$f":"IF(A23<>\"\",VLOOKUP($A23,Config!A:B,2,0),\"\")","v":""}]
[null,{"$f":"IF(A24<>\"\",VLOOKUP($A24,Config!A:B,2,0),\"\")","v":""}]
[null,{"$f":"IF(A25<>\"\",VLOOKUP($A25,Config!A:B,2,0),\"\")","v":""}]
[null,{"$f":"IF(A26<>\"\",VLOOKUP($A26,Config!A:B,2,0),\"\")","v":""}]
["PEPPE",{"$f":"IF(A27<>\"\",VLOOKUP($A27,Config!A:B,2,0),\"\")","v":"PEP"}]
[null,{"$f":"IF(A28<>\"\",VLOOKUP($A28,Config!A:B,2,0),\"\")","v":""}]
[null,{"$f":"IF(A29<>\"\",VLOOKUP($A29,Config!A:B,2,0),\"\")","v":""}]
[null,{"$f":"IF(A30<>\"\",VLOOKUP($A30,Config!A:B,2,0),\"\")","v":""}]

{"sheet":"Config","index":1,"n_rows":5,"n_cols":2,"rows_kept":5,"cut":false,"hidden":false,"merged":[]}
["NOME","SIGLA"]
["PEPPE","PEP"]
["GIANNI","GIA"]
["SALVO","SLV"]
["SIMONE","SIC"]