{"text_format":"1","workbook":"xlsx","n_sheets":2,"sheets":["Classifica","Tempi"],"not_rendered":{"charts":0,"images":1,"macros":1,"external_links":0,"defined_names":1,"comments":0,"pivot_tables":0},"unopened":[],"bounds":{"document_bytes":16777216,"sheet_cells":100000,"rows_first":2000,"rows_last":500,"rows_between":2000,"halvings":0,"cell_chars":16384,"cell_head_chars":4096},"cells_cut":0,"cells_raw":0,"read":"whole","date_system":"1900"}

{"sheet":"Classifica","index":0,"n_rows":13,"n_cols":9,"rows_kept":13,"cut":false,"hidden":false,"merged":[]}
["Cognome e nome","Cat.","spec.","tempo","arrotonda","concatena","Punteggio","Punteggio con Macro"]
["Ancora Rocco","MM40",800,"00:02:11.100",{"$f":"ROUND(D2,8)","v":"00:02:11.100"},{"$f":"CONCATENATE(B2,E2)","v":"MM400,00151736"},{"$f":"VLOOKUP(F2,Tempi!D$2:E$5894,2,FALSE)","v":576},576]
["Antonini Francesco","MM35",800,"00:02:17.400",{"$f":"ROUND(D3,8)","v":"00:02:17.400"},{"$f":"CONCATENATE(B3,E3)","v":"MM350,00159028"},{"$f":"VLOOKUP(F3,Tempi!D$2:E$5894,2,FALSE)","v":344},344]
["Argese Giacomo","MM35",800,"00:02:42.200","00:02:42.200","MM350,00187731",{"$f":"VLOOKUP(F4,Tempi!D$2:E$5894,2,FALSE)","v":{"$error":"#N/A"}},57,"il punteggio dovrebbe essere 57 [riga 597 del foglio \"Tempi]"]
["Ble Domenico","MM70",800,"00:02:35.200",{"$f":"ROUND(D5,8)","v":"00:02:35.200"},{"$f":"CONCATENATE(B5,E5)","v":"MM700,0017963"},{"$f":"VLOOKUP(F5,Tempi!D$2:E$5894,2,FALSE)","v":840},840]
["Buffo Orlando","MM40",800,"00:02:30","00:02:30","MM400,00173611",{"$f":"VLOOKUP(F6,Tempi!D$2:E$5894,2,FALSE)","v":259},259]
["Cervellera Davide","MM55",800,"00:02:39.500","00:02:39.500","MM550,00184606",{"$f":"VLOOKUP(F7,Tempi!D$2:E$5894,2,FALSE)","v":413},413]
["Colafati Antonello","MM65",800,"00:03:35.600","00:03:35.600","MM650,00249537",{"$f":"VLOOKUP(F8,Tempi!D$2:E$5894,2,FALSE)","v":{"$error":"#N/A"}},31,"il punteggio dovrebbe essere 31 [riga 5041 del foglio \"Tempi]"]
["Donnaloia Sante","MM35",800,"00:02:17.900","00:02:17.900","MM350,00159606",{"$f":"VLOOKUP(F9,Tempi!D$2:E$5894,2,FALSE)","v":336},336]
["Francavilla Stefano","MM35",800,"00:02:19.900","00:02:19.900","MM350,00161921",{"$f":"VLOOKUP(F10,Tempi!D$2:E$5894,2,FALSE)","v":304},304]
["Greco Vincenzo","MM45",800,"00:02:38.300","00:02:38.300","MM450,00183218",{"$f":"VLOOKUP(F11,Tempi!D$2:E$5894,2,FALSE)","v":242},242]
["Lagatta Matteo","MM55",800,"00:02:27.900","00:02:27.900","MM550,00171181",{"$f":"VLOOKUP(F12,Tempi!D$2:E$5894,2,FALSE)","v":605},605]
["Leo Teodoro","MM45",800,"00:02:35.200","00:02:35.200","MM450,0017963",{"$f":"VLOOKUP(F13,Tempi!D$2:E$5894,2,FALSE)","v":283},283]

{"sheet":"Tempi","index":1,"n_rows":5894,"n_cols":5,"rows_kept":5894,"cut":false,"hidden":false,"merged":[]}
["distanza","categoria","tempo","concatena","punteggio"]
[800,"MM35","00:01:41.400",{"$f":"CONCATENATE(B2,C2)","v":"MM350,00117361"},1299]
[800,"MM35","00:01:41.500",{"$f":"CONCATENATE(B3,C3)","v":"MM350,00117477"},1292]
[800,"MM35","00:01:41.600","MM350,00117593",1285]
[800,"MM35","00:01:41.700","MM350,00117708",1278]
[800,"MM35","00:01:41.800","MM350,00117824",1272]
[800,"MM35","00:01:41.900","MM350,0011794",1265]
[800,"MM35","00:01:42","MM350,00118056",1258]
[800,"MM35","00:01:42.100","MM350,00118171",1252]
[800,"MM35","00:01:42.200","MM350,00118287",1245]
[800,"MM35","00:01:42.300","MM350,00118403",1239]
[800,"MM35","00:01:42.400","MM350,00118519",1233]
[800,"MM35","00:01:42.500","MM350,00118634",1227]
[800,"MM35","00:01:42.600","MM350,0011875",1220]
[800,"MM35","00:01:42.700","MM350,00118866",1214]
[800,"MM35","00:01:42.800","MM350,00118981",1208]
[800,"MM35","00:01:42.900","MM350,00119097",1202]
[800,"MM35","00:01:43","MM350,00119213",1196]
[800,"MM35","00:01:43.100","MM350,00119329",1191]
[800,"MM35","00:01:43.200","MM350,00119444",1185]
[800,"MM35","00:01:43.300","MM350,0011956",1179]
[800,"MM35","00:01:43.400","MM350,00119676",1174]
[800,"MM35","00:01:43.500","MM350,00119792",1169]
[800,"MM35","00:01:43.600","MM350,00119907",1163]
[800,"MM35","00:01:43.700","MM350,00120023",1158]
[800,"MM35","00:01:43.800","MM350,00120139",1153]
[800,"MM35","00:01:43.900","MM350,00120255",1147]
[800,"MM35","00:01:44","MM350,0012037",1142]
[800,"MM35","00:01:44.100","MM350,00120486",1137]
[800,"MM35","00:01:44.200","MM350,00120602",1132]
[800,"MM35","00:01:44.300","MM350,00120718",1127]
[800,"MM35","00:01:44.400","MM350,00120833",1122]
[800,"MM35","00:01:44.500","MM350,00120949",1117]
[800,"MM35","00:01:44.600","MM350,00121065",1113]
[800,"MM35","00:01:44.700","MM350,00121181",1108]
[800,"MM35","00:01:44.800","MM350,00121296",1103]
[800,"MM35","00:01:44.900","MM350,00121412",1099]
[800,"MM35","00:01:45","MM350,00121528",1094]
[800,"MM35","00:01:45.100","MM350,00121644",1090]
[800,"MM35","00:01:45.200","MM350,00121759",1085]
[800,"MM35","00:01:45.300","MM350,00121875",1081]
[800,"MM35","00:01:45.400","MM350,00121991",1077]
[800,"MM35","00:01:45.500","MM350,00122106",1073]
[800,"MM35","00:01:45.600","MM350,00122222",1069]
[800,"MM35","00:01:45.700","MM350,00122338",1065]
[800,"MM35","00:01:45.800","MM350,00122454",1061]
[800,"MM35","00:01:45.900","MM350,00122569",1057]
[800,"MM35","00:01:46","MM350,00122685",1053]
[800,"MM35","00:01:46.100","MM350,00122801",1049]
[800,"MM35","00:01:46.200","MM350,00122917",1046]
[800,"MM35","00:01:46.300","MM350,00123032",1042]
[800,"MM35","00:01:46.400","MM350,00123148",1038]
[800,"MM35","00:01:46.500","MM350,00123264",1035]
[800,"MM35","00:01:46.600","MM350,0012338",1031]
[800,"MM35","00:01:46.700","MM350,00123495",1028]
[800,"MM35","00:01:46.800","MM350,00123611",1025]
[800,"MM35","00:01:46.900","MM350,00123727",1022]
[800,"MM35","00:01:47","MM350,00123843",1019]
[800,"MM35","00:01:47.100","MM350,00123958",1015]
[800,"MM35","00:01:47.200","MM350,00124074",1012]
[800,"MM35","00:01:47.300","MM350,0012419",1009]
[800,"MM35","00:01:47.400","MM350,00124306",1006]
[800,"MM35","00:01:47.500","MM350,00124421",1003]
[800,"MM35","00:01:47.600","MM350,00124537",1001]
[800,"MM35","00:01:47.700","MM350,00124653",998]
[800,"MM35","00:01:47.800","MM350,00124769",995]
[800,"MM35","00:01:47.900",{"$f":"CONCATENATE(B67,C67)","v":"MM350,00124884"},992]
[800,"MM35","00:01:48","MM350,00125",990]
[800,"MM35","00:01:48.100","MM350,00125116",987]
[800,"MM35","00:01:48.200","MM350,00125231",984]
[800,"MM35","00:01:48.300","MM350,00125347",981]
[800,"MM35","00:01:48.400","MM350,00125463",978]
[800,"MM35","00:01:48.500","MM350,00125579",976]
[800,"MM35","00:01:48.600","MM350,00125694",973]
[800,"MM35","00:01:48.700","MM350,0012581",970]
[800,"MM35","00:01:48.800","MM350,00125926",967]
[800,"MM35","00:01:48.900","MM350,00126042",965]
[800,"MM35","00:01:49","MM350,00126157",962]
[800,"MM35","00:01:49.100","MM350,00126273",959]
[800,"MM35","00:01:49.200","MM350,00126389",957]
[800,"MM35","00:01:49.300","MM350,00126505",954]
[800,"MM35","00:01:49.400","MM350,0012662",951]
[800,"MM35","00:01:49.500","MM350,00126736",948]
[800,"MM35","00:01:49.600","MM350,00126852",946]
[800,"MM35","00:01:49.700","MM350,00126968",943]
[800,"MM35","00:01:49.800","MM350,00127083",940]
[800,"MM35","00:01:49.900","MM350,00127199",938]
[800,"MM35","00:01:50","MM350,00127315",935]
[800,"MM35","00:01:50.100","MM350,00127431",932]
[800,"MM35","00:01:50.200","MM350,00127546",930]
[800,"MM35","00:01:50.300","MM350,00127662",927]
[800,"MM35","00:01:50.400","MM350,00127778",924]
[800,"MM35","00:01:50.500","MM350,00127894",922]
[800,"MM35","00:01:50.600","MM350,00128009",919]
[800,"MM35","00:01:50.700","MM350,00128125",916]
[800,"MM35","00:01:50.800","MM350,00128241",914]
[800,"MM35","00:01:50.900","MM350,00128356",911]
[800,"MM35","00:01:51","MM350,00128472",908]
[800,"MM35","00:01:51.100","MM350,00128588",906]
[800,"MM35","00:01:51.200","MM350,00128704",903]
[800,"MM35","00:01:51.300","MM350,00128819",901]
[800,"MM35","00:01:51.400","MM350,00128935",898]
[800,"MM35","00:01:51.500","MM350,00129051",895]
[800,"MM35","00:01:51.600","MM350,00129167",893]
[800,"MM35","00:01:51.700","MM350,00129282",890]
[800,"MM35","00:01:51.800","MM350,00129398",887]
[800,"MM35","00:01:51.900","MM350,00129514",885]
[800,"MM35","00:01:52","MM350,0012963",882]
[800,"MM35","00:01:52.100","MM350,00129745",880]
[800,"MM35","00:01:52.200","MM350,00129861",877]
[800,"MM35","00:01:52.300","MM350,00129977",874]
[800,"MM35","00:01:52.400","MM350,00130093",872]
[800,"MM35","00:01:52.500","MM350,00130208",869]
[800,"MM35","00:01:52.600","MM350,00130324",867]
[800,"MM35","00:01:52.700","MM350,0013044",864]
[800,"MM35","00:01:52.800","MM350,00130556",861]
[800,"MM35","00:01:52.900","MM350,00130671",859]
[800,"MM35","00:01:53","MM350,00130787",856]
[800,"MM35","00:01:53.100","MM350,00130903",854]
[800,"MM35","00:01:53.200","MM350,00131019",851]
[800,"MM35","00:01:53.300","MM350,00131134",849]
[800,"MM35","00:01:53.400","MM350,0013125",846]
[800,"MM35","00:01:53.500","MM350,00131366",843]
[800,"MM35","00:01:53.600","MM350,00131481",841]
[800,"MM35","00:01:53.700","MM350,00131597",838]
[800,"MM35","00:01:53.800","MM350,00131713",836]
[800,"MM35","00:01:53.900","MM350,00131829",833]
[800,"MM35","00:01:54","MM350,00131944",831]
[800,"MM35","00:01:54.100","MM350,0013206",828]
[800,"MM35","00:01:54.200","MM350,00132176",826]
[800,"MM35","00:01:54.300",{"$f":"CONCATENATE(B131,C131)","v":"MM350,00132292"},823]
[800,"MM35","00:01:54.400","MM350,00132407",821]
[800,"MM35","00:01:54.500","MM350,00132523",818]
[800,"MM35","00:01:54.600","MM350,00132639",816]
[800,"MM35","00:01:54.700","MM350,00132755",813]
[800,"MM35","00:01:54.800","MM350,0013287",811]
[800,"MM35","00:01:54.900","MM350,00132986",808]
[800,"MM35","00:01:55","MM350,00133102",806]
[800,"MM35","00:01:55.100","MM350,00133218",803]
[800,"MM35","00:01:55.200","MM350,00133333",801]
[800,"MM35","00:01:55.300","MM350,00133449",798]
[800,"MM35","00:01:55.400","MM350,00133565",796]
[800,"MM35","00:01:55.500","MM350,00133681",793]
[800,"MM35","00:01:55.600","MM350,00133796",791]
[800,"MM35","00:01:55.700","MM350,00133912",788]
[800,"MM35","00:01:55.800","MM350,00134028",786]
[800,"MM35","00:01:55.900","MM350,00134144",783]
[800,"MM35","00:01:56","MM350,00134259",781]
[800,"MM35","00:01:56.100","MM350,00134375",778]
[800,"MM35","00:01:56.200","MM350,00134491",776]
[800,"MM35","00:01:56.300","MM350,00134606",774]
[800,"MM35","00:01:56.400","MM350,00134722",771]
[800,"MM35","00:01:56.500","MM350,00134838",769]
[800,"MM35","00:01:56.600","MM350,00134954",766]
[800,"MM35","00:01:56.700","MM350,00135069",764]
[800,"MM35","00:01:56.800","MM350,00135185",761]
[800,"MM35","00:01:56.900","MM350,00135301",759]
[800,"MM35","00:01:57","MM350,00135417",757]
[800,"MM35","00:01:57.100","MM350,00135532",754]
[800,"MM35","00:01:57.200","MM350,00135648",752]
[800,"MM35","00:01:57.300","MM350,00135764",750]
[800,"MM35","00:01:57.400","MM350,0013588",747]
[800,"MM35","00:01:57.500","MM350,00135995",745]
[800,"MM35","00:01:57.600","MM350,00136111",742]
[800,"MM35","00:01:57.700","MM350,00136227",740]
[800,"MM35","00:01:57.800","MM350,00136343",738]
[800,"MM35","00:01:57.900","MM350,00136458",735]
[800,"MM35","00:01:58","MM350,00136574",733]
[800,"MM35","00:01:58.100","MM350,0013669",730]
[800,"MM35","00:01:58.200","MM350,00136806",728]
[800,"MM35","00:01:58.300","MM350,00136921",726]
[800,"MM35","00:01:58.400","MM350,00137037",723]
[800,"MM35","00:01:58.500","MM350,00137153",721]
[800,"MM35","00:01:58.600","MM350,00137269",719]
[800,"MM35","00:01:58.700","MM350,00137384",716]
[800,"MM35","00:01:58.800","MM350,001375",714]
[800,"MM35","00:01:58.900","MM350,00137616",711]
[800,"MM35","00:01:59","MM350,00137731",709]
[800,"MM35","00:01:59.100","MM350,00137847",707]
[800,"MM35","00:01:59.200","MM350,00137963",704]
[800,"MM35","00:01:59.300","MM350,00138079",702]
[800,"MM35","00:01:59.400","MM350,00138194",700]
[800,"MM35","00:01:59.500","MM350,0013831",697]
[800,"MM35","00:01:59.600","MM350,00138426",695]
[800,"MM35","00:01:59.700","MM350,00138542",693]
[800,"MM35","00:01:59.800","MM350,00138657",690]
[800,"MM35","00:01:59.900","MM350,00138773",688]
[800,"MM35","00:02:00","MM350,00138889",686]
[800,"MM35","00:02:00.100","MM350,00139005",684]
[800,"MM35","00:02:00.200","MM350,0013912",681]
[800,"MM35","00:02:00.300","MM350,00139236",679]
[800,"MM35","00:02:00.400","MM350,00139352",677]
[800,"MM35","00:02:00.500","MM350,00139468",674]
[800,"MM35","00:02:00.600","MM350,00139583",672]
[800,"MM35","00:02:00.700",{"$f":"CONCATENATE(B195,C195)","v":"MM350,00139699"},670]
[800,"MM35","00:02:00.800","MM350,00139815",668]
[800,"MM35","00:02:00.900","MM350,00139931",666]
[800,"MM35","00:02:01","MM350,00140046",663]
[800,"MM35","00:02:01.100","MM350,00140162",661]
[800,"MM35","00:02:01.200","MM350,00140278",659]
[800,"MM35","00:02:01.300","MM350,00140394",656]
[800,"MM35","00:02:01.400","MM350,00140509",654]
[800,"MM35","00:02:01.500","MM350,00140625",652]
[800,"MM35","00:02:01.600","MM350,00140741",650]
[800,"MM35","00:02:01.700","MM350,00140856",647]
[800,"MM35","00:02:01.800","MM350,00140972",645]
[800,"MM35","00:02:01.900","MM350,00141088",643]
[800,"MM35","00:02:02","MM350,00141204",641]
[800,"MM35","00:02:02.100","MM350,00141319",639]
[800,"MM35","00:02:02.200","MM350,00141435",636]
[800,"MM35","00:02:02.300","MM350,00141551",634]
[800,"MM35","00:02:02.400","MM350,00141667",632]
[800,"MM35","00:02:02.500","MM350,00141782",630]
[800,"MM35","00:02:02.600","MM350,00141898",627]
[800,"MM35","00:02:02.700","MM350,00142014",625]
[800,"MM35","00:02:02.800","MM350,0014213",623]
[800,"MM35","00:02:02.900","MM350,00142245",621]
[800,"MM35","00:02:03","MM350,00142361",619]
[800,"MM35","00:02:03.100","MM350,00142477",616]
[800,"MM35","00:02:03.200","MM350,00142593",614]
[800,"MM35","00:02:03.300","MM350,00142708",612]
[800,"MM35","00:02:03.400","MM350,00142824",610]
[800,"MM35","00:02:03.500","MM350,0014294",608]
[800,"MM35","00:02:03.600","MM350,00143056",606]
[800,"MM35","00:02:03.700","MM350,00143171",603]
[800,"MM35","00:02:03.800","MM350,00143287",601]
[800,"MM35","00:02:03.900","MM350,00143403",599]
[800,"MM35","00:02:04","MM350,00143519",597]
[800,"MM35","00:02:04.100","MM350,00143634",595]
[800,"MM35","00:02:04.200","MM350,0014375",593]
[800,"MM35","00:02:04.300","MM350,00143866",591]
[800,"MM35","00:02:04.400","MM350,00143981",589]
[800,"MM35","00:02:04.500","MM350,00144097",586]
[800,"MM35","00:02:04.600","MM350,00144213",584]
[800,"MM35","00:02:04.700","MM350,00144329",582]
[800,"MM35","00:02:04.800","MM350,00144444",580]
[800,"MM35","00:02:04.900","MM350,0014456",578]
[800,"MM35","00:02:05","MM350,00144676",576]
[800,"MM35","00:02:05.100","MM350,00144792",574]
[800,"MM35","00:02:05.200","MM350,00144907",572]
[800,"MM35","00:02:05.300","MM350,00145023",570]
[800,"MM35","00:02:05.400","MM350,00145139",567]
[800,"MM35","00:02:05.500","MM350,00145255",565]
[800,"MM35","00:02:05.600","MM350,0014537",563]
[800,"MM35","00:02:05.700","MM350,00145486",561]
[800,"MM35","00:02:05.800","MM350,00145602",559]
[800,"MM35","00:02:05.900","MM350,00145718",557]
[800,"MM35","00:02:06","MM350,00145833",555]
[800,"MM35","00:02:06.100","MM350,00145949",553]
[800,"MM35","00:02:06.200","MM350,00146065",551]
[800,"MM35","00:02:06.300","MM350,00146181",549]
[800,"MM35","00:02:06.400","MM350,00146296",547]
[800,"MM35","00:02:06.500","MM350,00146412",545]
[800,"MM35","00:02:06.600","MM350,00146528",542]
[800,"MM35","00:02:06.700","MM350,00146644",540]
[800,"MM35","00:02:06.800","MM350,00146759",538]
[800,"MM35","00:02:06.900","MM350,00146875",536]
[800,"MM35","00:02:07","MM350,00146991",534]
[800,"MM35","00:02:07.100",{"$f":"CONCATENATE(B259,C259)","v":"MM350,00147106"},532]
[800,"MM35","00:02:07.200","MM350,00147222",530]
[800,"MM35","00:02:07.300","MM350,00147338",528]
[800,"MM35","00:02:07.400","MM350,00147454",526]
[800,"MM35","00:02:07.500","MM350,00147569",524]
[800,"MM35","00:02:07.600","MM350,00147685",522]
[800,"MM35","00:02:07.700","MM350,00147801",520]
[800,"MM35","00:02:07.800","MM350,00147917",518]
[800,"MM35","00:02:07.900","MM350,00148032",516]
[800,"MM35","00:02:08","MM350,00148148",514]
[800,"MM35","00:02:08.100","MM350,00148264",512]
[800,"MM35","00:02:08.200","MM350,0014838",510]
[800,"MM35","00:02:08.300","MM350,00148495",508]
[800,"MM35","00:02:08.400","MM350,00148611",506]
[800,"MM35","00:02:08.500","MM350,00148727",504]
[800,"MM35","00:02:08.600","MM350,00148843",502]
[800,"MM35","00:02:08.700","MM350,00148958",500]
[800,"MM35","00:02:08.800","MM350,00149074",498]
[800,"MM35","00:02:08.900","MM350,0014919",497]
[800,"MM35","00:02:09","MM350,00149306",495]
[800,"MM35","00:02:09.100","MM350,00149421",493]
[800,"MM35","00:02:09.200","MM350,00149537",491]
[800,"MM35","00:02:09.300","MM350,00149653",489]
[800,"MM35","00:02:09.400","MM350,00149769",487]
[800,"MM35","00:02:09.500","MM350,00149884",485]
[800,"MM35","00:02:09.600","MM350,0015",483]
[800,"MM35","00:02:09.700","MM350,00150116",481]
[800,"MM35","00:02:09.800","MM350,00150231",479]
[800,"MM35","00:02:09.900","MM350,00150347",477]
[800,"MM35","00:02:10","MM350,00150463",475]
[800,"MM35","00:02:10.100","MM350,00150579",473]
[800,"MM35","00:02:10.200","MM350,00150694",471]
[800,"MM35","00:02:10.300","MM350,0015081",469]
[800,"MM35","00:02:10.400","MM350,00150926",467]
[800,"MM35","00:02:10.500","MM350,00151042",466]
[800,"MM35","00:02:10.600","MM350,00151157",464]
[800,"MM35","00:02:10.700","MM350,00151273",462]
[800,"MM35","00:02:10.800","MM350,00151389",460]
[800,"MM35","00:02:10.900","MM350,00151505",458]
[800,"MM35","00:02:11","MM350,0015162",456]
[800,"MM35","00:02:11.100","MM350,00151736",454]
[800,"MM35","00:02:11.200","MM350,00151852",453]
[800,"MM35","00:02:11.300","MM350,00151968",451]
[800,"MM35","00:02:11.400","MM350,00152083",449]
[800,"MM35","00:02:11.500","MM350,00152199",447]
[800,"MM35","00:02:11.600","MM350,00152315",445]
[800,"MM35","00:02:11.700","MM350,00152431",443]
[800,"MM35","00:02:11.800","MM350,00152546",441]
[800,"MM35","00:02:11.900","MM350,00152662",440]
[800,"MM35","00:02:12","MM350,00152778",438]
[800,"MM35","00:02:12.100","MM350,00152894",436]
[800,"MM35","00:02:12.200","MM350,00153009",434]
[800,"MM35","00:02:12.300","MM350,00153125",432]
[800,"MM35","00:02:12.400","MM350,00153241",430]
[800,"MM35","00:02:12.500","MM350,00153356",429]
[800,"MM35","00:02:12.600","MM350,00153472",427]
[800,"MM35","00:02:12.700","MM350,00153588",425]
[800,"MM35","00:02:12.800","MM350,00153704",423]
[800,"MM35","00:02:12.900","MM350,00153819",421]
[800,"MM35","00:02:13","MM350,00153935",419]
[800,"MM35","00:02:13.100","MM350,00154051",418]
[800,"MM35","00:02:13.200","MM350,00154167",416]
[800,"MM35","00:02:13.300","MM350,00154282",414]
[800,"MM35","00:02:13.400","MM350,00154398",412]
[800,"MM35","00:02:13.500",{"$f":"CONCATENATE(B323,C323)","v":"MM350,00154514"},410]
[800,"MM35","00:02:13.600","MM350,0015463",409]
[800,"MM35","00:02:13.700","MM350,00154745",407]
[800,"MM35","00:02:13.800","MM350,00154861",405]
[800,"MM35","00:02:13.900","MM350,00154977",403]
[800,"MM35","00:02:14","MM350,00155093",402]
[800,"MM35","00:02:14.100","MM350,00155208",400]
[800,"MM35","00:02:14.200","MM350,00155324",398]
[800,"MM35","00:02:14.300","MM350,0015544",396]
[800,"MM35","00:02:14.400","MM350,00155556",395]
[800,"MM35","00:02:14.500","MM350,00155671",393]
[800,"MM35","00:02:14.600","MM350,00155787",391]
[800,"MM35","00:02:14.700","MM350,00155903",389]
[800,"MM35","00:02:14.800","MM350,00156019",388]
[800,"MM35","00:02:14.900","MM350,00156134",386]
[800,"MM35","00:02:15","MM350,0015625",384]
[800,"MM35","00:02:15.100","MM350,00156366",383]
[800,"MM35","00:02:15.200","MM350,00156481",381]
[800,"MM35","00:02:15.300","MM350,00156597",379]
[800,"MM35","00:02:15.400","MM350,00156713",377]
[800,"MM35","00:02:15.500","MM350,00156829",376]
[800,"MM35","00:02:15.600","MM350,00156944",374]
[800,"MM35","00:02:15.700","MM350,0015706",372]
[800,"MM35","00:02:15.800","MM350,00157176",371]
[800,"MM35","00:02:15.900","MM350,00157292",369]
[800,"MM35","00:02:16","MM350,00157407",367]
[800,"MM35","00:02:16.100","MM350,00157523",365]
[800,"MM35","00:02:16.200","MM350,00157639",364]
[800,"MM35","00:02:16.300","MM350,00157755",362]
[800,"MM35","00:02:16.400","MM350,0015787",360]
[800,"MM35","00:02:16.500","MM350,00157986",359]
[800,"MM35","00:02:16.600","MM350,00158102",357]
[800,"MM35","00:02:16.700","MM350,00158218",355]
[800,"MM35","00:02:16.800","MM350,00158333",354]
[800,"MM35","00:02:16.900","MM350,00158449",352]
[800,"MM35","00:02:17","MM350,00158565",350]
[800,"MM35","00:02:17.100","MM350,00158681",349]
[800,"MM35","00:02:17.200","MM350,00158796",347]
[800,"MM35","00:02:17.300","MM350,00158912",346]
[800,"MM35","00:02:17.400","MM350,00159028",344]
[800,"MM35","00:02:17.500","MM350,00159144",342]
[800,"MM35","00:02:17.600","MM350,00159259",341]
[800,"MM35","00:02:17.700","MM350,00159375",339]
[800,"MM35","00:02:17.800","MM350,00159491",337]
[800,"MM35","00:02:17.900","MM350,00159606",336]
[800,"MM35","00:02:18","MM350,00159722",334]
[800,"MM35","00:02:18.100","MM350,00159838",333]
[800,"MM35","00:02:18.200","MM350,00159954",331]
[800,"MM35","00:02:18.300","MM350,00160069",329]
[800,"MM35","00:02:18.400","MM350,00160185",328]
[800,"MM35","00:02:18.500","MM350,00160301",326]
[800,"MM35","00:02:18.600","MM350,00160417",325]
[800,"MM35","00:02:18.700","MM350,00160532",323]
[800,"MM35","00:02:18.800","MM350,00160648",321]
[800,"MM35","00:02:18.900","MM350,00160764",320]
[800,"MM35","00:02:19","MM350,0016088",318]
[800,"MM35","00:02:19.100","MM350,00160995",317]
[800,"MM35","00:02:19.200","MM350,00161111",315]
[800,"MM35","00:02:19.300","MM350,00161227",314]
[800,"MM35","00:02:19.400","MM350,00161343",312]
[800,"MM35","00:02:19.500","MM350,00161458",311]
[800,"MM35","00:02:19.600","MM350,00161574",309]
[800,"MM35","00:02:19.700","MM350,0016169",307]
[800,"MM35","00:02:19.800","MM350,00161806",306]
[800,"MM35","00:02:19.900",{"$f":"CONCATENATE(B387,C387)","v":"MM350,00161921"},304]
[800,"MM35","00:02:20","MM350,00162037",303]
[800,"MM35","00:02:20.100","MM350,00162153",301]
[800,"MM35","00:02:20.200","MM350,00162269",300]
[800,"MM35","00:02:20.300","MM350,00162384",298]
[800,"MM35","00:02:20.400","MM350,001625",297]
[800,"MM35","00:02:20.500","MM350,00162616",295]
[800,"MM35","00:02:20.600","MM350,00162731",294]
[800,"MM35","00:02:20.700","MM350,00162847",292]
[800,"MM35","00:02:20.800","MM350,00162963",291]
[800,"MM35","00:02:20.900","MM350,00163079",289]
[800,"MM35","00:02:21","MM350,00163194",288]
[800,"MM35","00:02:21.100","MM350,0016331",286]
[800,"MM35","00:02:21.200","MM350,00163426",285]
{"$rows_left_out":5494}